Reaction Details
TargetProstaglandin G/H synthase 1
LigandBDBM50269606
Substrate/Competitorn/a
Meas. Tech.ChEMBL_480246 (CHEMBL1020815)
IC50 11700±n/a nM
Citation Su, BNCuendet, MHawthorne, MEKardono, LBRiswan, SFong, HHMehta, RGPezzuto, JMKinghorn, AD Constituents of the bark and twigs of Artocarpus dadah with cyclooxygenase inhibitory activity. J Nat Prod65:163-9 (2002) Prostaglandin G/H synthase 1
Name:Prostaglandin G/H synthase 1
Type:Enzyme
Mol. Mass.:68692.62
Organism:Homo sapiens (Human)
Description:P23219
Residue:599
BDBM50269606
NameBDBM50269606
Synonyms:CHEMBL517334 | isogemichalcone B
TypeSmall organic molecule
Emp. Form.C29H26O7
Mol. Mass.486.5125
SMILESC\C(COC(=O)\C=C\c1ccc(O)cc1)=C/Cc1c(O)ccc(C(=O)\C=C\c2ccc(O)cc2)c1O