Reaction Details
TargetProstaglandin G/H synthase 1
LigandBDBM50269559
Substrate/Competitorn/a
Meas. Tech.ChEMBL_480246 (CHEMBL1020815)
IC50 14000±n/a nM
Citation Su, BNCuendet, MHawthorne, MEKardono, LBRiswan, SFong, HHMehta, RGPezzuto, JMKinghorn, AD Constituents of the bark and twigs of Artocarpus dadah with cyclooxygenase inhibitory activity. J Nat Prod65:163-9 (2002) Prostaglandin G/H synthase 1
Name:Prostaglandin G/H synthase 1
Type:Enzyme
Mol. Mass.:68692.62
Organism:Homo sapiens (Human)
Description:P23219
Residue:599
BDBM50269559
NameBDBM50269559
Synonyms:2-(2,4-dihydroxyphenyl)-5,7-dihydroxy-4H-chromen-4-one Norartocarpetin, 5 | norartocarpetin
TypeSmall organic molecule
Emp. Form.C15H10O6
Mol. Mass.286.2363
SMILESOc1ccc(c(O)c1)-c1cc(=O)c2c(O)cc(O)cc2o1