Reaction Details
TargetCannabinoid receptor 1
LigandBDBM50260628
Substrate/Competitorn/a
Meas. Tech.ChEMBL_552268 (CHEMBL995598)
Ki>4040±n/a nM
Citation Omura, HKawai, MShima, AIwata, YIto, FMasuda, TOhta, AMakita, NOmoto, KSugimoto, HKikuchi, AIwata, HAndo, K The SAR studies of novel CB2 selective agonists, benzimidazolone derivatives. Bioorg Med Chem Lett18:3310-4 (2008) 
 
Cannabinoid receptor 1
Name:Cannabinoid receptor 1
Type:G Protein-Coupled Receptor (GPCR)
Mol. Mass.:52868.96
Organism:Homo sapiens (Human)
Description:P21554
Residue:472
BDBM50260628
NameBDBM50260628
Synonyms:CHEMBL495391 | N-((2S,3S)-1-amino-3-methyl-1-oxopentan-2-yl)-3-(2-morpholinoethyl)-2-oxo-2,3-dihydrobenzo[d]imidazole-1-carboxamide
TypeSmall organic molecule
Emp. Form.C20H29N5O4
Mol. Mass.403.4754
SMILESCC[C@H](C)[C@H](NC(=O)n1c2ccccc2n(CCN2CCOCC2)c1=O)C(N)=O