Reaction Details
TargetCannabinoid receptor 1
LigandBDBM50261102
Substrate/Competitorn/a
Meas. Tech.ChEMBL_552268 (CHEMBL995598)
IC50>10000±n/a nM
Citation Omura, HKawai, MShima, AIwata, YIto, FMasuda, TOhta, AMakita, NOmoto, KSugimoto, HKikuchi, AIwata, HAndo, K The SAR studies of novel CB2 selective agonists, benzimidazolone derivatives. Bioorg Med Chem Lett18:3310-4 (2008) 
 
Cannabinoid receptor 1
Name:Cannabinoid receptor 1
Type:G Protein-Coupled Receptor (GPCR)
Mol. Mass.:52868.96
Organism:Homo sapiens (Human)
Description:P21554
Residue:472
BDBM50261102
NameBDBM50261102
Synonyms:CHEMBL493804 | N-(1-(4-fluorophenyl)ethyl)-3-(2-morpholinoethyl)-2-oxo-2,3-dihydrobenzo[d]imidazole-1-carboxamide
TypeSmall organic molecule
Emp. Form.C22H25FN4O3
Mol. Mass.412.4573
SMILESCC(NC(=O)n1c2ccccc2n(CCN2CCOCC2)c1=O)c1ccc(F)cc1