Reaction Details
TargetCannabinoid receptor 2
LigandBDBM50260712
Substrate/Competitorn/a
Meas. Tech.ChEMBL_552264 (CHEMBL995594)
Ki 1±n/a nM
Citation Omura, HKawai, MShima, AIwata, YIto, FMasuda, TOhta, AMakita, NOmoto, KSugimoto, HKikuchi, AIwata, HAndo, K The SAR studies of novel CB2 selective agonists, benzimidazolone derivatives. Bioorg Med Chem Lett18:3310-4 (2008) 
 
Cannabinoid receptor 2
Name:Cannabinoid receptor 2
Type:G Protein-Coupled Receptor (GPCR)
Mol. Mass.:39690.94
Organism:Homo sapiens (Human)
Description:P34972
Residue:360
BDBM50260712
NameBDBM50260712
Synonyms:(S)-N-(1-amino-3,3-dimethyl-1-oxobutan-2-yl)-3-isopentyl-2-oxo-2,3-dihydrobenzo[d]imidazole-1-carboxamide | CHEMBL527071
TypeSmall organic molecule
Emp. Form.C19H28N4O3
Mol. Mass.360.4506
SMILESCC(C)CCn1c2ccccc2n(C(=O)N[C@H](C(N)=O)C(C)(C)C)c1=O