Reaction Details
TargetAcetylcholinesterase
LigandBDBM10440
Substrate/Competitorn/a
Meas. Tech.ChEMBL_555815 (CHEMBL965675)
IC50 52±n/a nM
Citation Butini, SCampiani, GBorriello, MGemma, SPanico, APersico, MCatalanotti, BRos, SBrindisi, MAgnusdei, MFiorini, INacci, VNovellino, EBelinskaya, TSaxena, AFattorusso, C Exploiting protein fluctuations at the active-site gorge of human cholinesterases: further optimization of the design strategy to develop extremely potent inhibitors. J Med Chem51:3154-70 (2008) 
 
Acetylcholinesterase
Name:Acetylcholinesterase
Type:Enzyme
Mol. Mass.:68193.62
Organism:Rattus norvegicus (rat)
Description:P37136
Residue:614
BDBM10440
NameBDBM10440
Synonyms:(5S)-5-[(12-{[(5S)-2-oxo-1,2,5,6,7,8-hexahydroquinolin-5-yl]amino}dodecyl)amino]-1,2,5,6,7,8-hexahydroquinolin-2-one | (S,S)-(-)-bis(12)-hupyridone
TypeSmall organic molecule
Emp. Form.C30H46N4O2
Mol. Mass.494.7118
SMILESO=c1ccc2[C@H](CCCc2[nH]1)NCCCCCCCCCCCCN[C@H]1CCCc2[nH]c(=O)ccc12