Reaction Details
TargetP2Y purinoceptor 4
LigandBDBM50270553
Substrate/Competitorn/a
Meas. Tech.ChEMBL_552863 (CHEMBL958068)
EC50 140±n/a nM
Citation Ko, HCarter, RLCosyn, LPetrelli, Rde Castro, SBesada, PZhou, YCappellacci, LFranchetti, PGrifantini, MVan Calenbergh, SHarden, TKJacobson, KA Synthesis and potency of novel uracil nucleotides and derivatives as P2Y2 and P2Y6 receptor agonists. Bioorg Med Chem16:6319-32 (2008) 
 
P2Y purinoceptor 4
Name:P2Y purinoceptor 4
Type:PROTEIN
Mol. Mass.:40977.17
Organism:Homo sapiens (Human)
Description:ChEMBL_751027
Residue:365
BDBM50270553
NameBDBM50270553
Synonyms:CHEMBL507282 INS37217
TypeSmall organic molecule
Emp. Form.C18H27N5O21P4
Mol. Mass.773.3229
SMILESNc1ccn([C@H]2C[C@H](O)[C@@H](COP(O)(=O)OP(O)(=O)OP(O)(=O)OP(O)(=O)OC[C@H]3O[C@H]([C@H](O)[C@@H]3O)n3ccc(=O)[nH]c3=O)O2)c(=O)n1