Reaction Details
TargetMyeloblastin
LigandBDBM50270029
Substrate/Competitorn/a
Meas. Tech.ChEMBL_508142 (CHEMBL1004879)
IC50>50000±n/a nM
Citation Méthot, NRubin, JGuay, DBeaulieu, CEthier, DReddy, TJRiendeau, DPercival, MD Inhibition of the activation of multiple serine proteases with a cathepsin C inhibitor requires sustained exposure to prevent pro-enzyme processing. J Biol Chem282:20836-46 (2007) 
 
Myeloblastin
Name:Myeloblastin
Type:PROTEIN
Mol. Mass.:27816.30
Organism:Homo sapiens (Human)
Description:ChEMBL_1463425
Residue:256
BDBM50270029
NameBDBM50270029
Synonyms:2-Amino-N-[(S)-3-diazo-1-(4-iodo-benzyl)-2-oxo-propyl]-acetamide | CHEMBL450997
TypeSmall organic molecule
Emp. Form.C12H13IN4O2
Mol. Mass.372.1617
SMILESNCC(=O)N[C@@H](Cc1ccc(I)cc1)C(=O)[CH-][N+]#N