Reaction Details
TargetFatty-acid amide hydrolase 1 [30-579]
LigandBDBM50262420
Substrate/Competitorn/a
Meas. Tech.ChEMBL_513860 (CHEMBL970754)
Ki 30.0±n/a nM
Citation Garfunkle, JEzzili, CRayl, TJHochstatter, DGHwang, IBoger, DL Optimization of the central heterocycle of alpha-ketoheterocycle inhibitors of fatty acid amide hydrolase. J Med Chem51:4392-403 (2008) 
 
Fatty-acid amide hydrolase 1 [30-579]
Name:Fatty-acid amide hydrolase 1 [30-579]
Type:Single-pass membrane protein; homodimer
Mol. Mass.:60474.00
Organism:Rattus norvegicus (rat)
Description:P97612 (aa 30-579)
Residue:550
BDBM50262420
NameBDBM50262420
Synonyms:7-Phenyl-1-(5-(pyridin-2-yl)-1,3,4-thiadiazol-2-yl)-heptan-1-one | CHEMBL477372
TypeSmall organic molecule
Emp. Form.C20H21N3OS
Mol. Mass.351.465
SMILESO=C(CCCCCCc1ccccc1)c1nnc(s1)-c1ccccn1