Reaction Details
TargetCannabinoid receptor 1
LigandBDBM50272276
Substrate/Competitorn/a
Meas. Tech.ChEMBL_510483 (CHEMBL1006424)
EC50 220±n/a nM
Citation Cheng, YAlbrecht, BKBrown, JBuchanan, JLBuckner, WHDiMauro, EFEmkey, RFremeau, RTHarmange, JCHoffman, BJHuang, LHuang, MLee, JHLin, FFMartin, MWNguyen, HQPatel, VFTomlinson, SAWhite, RDXia, XHitchcock, SA Discovery and optimization of a novel series of N-arylamide oxadiazoles as potent, highly selective and orally bioavailable cannabinoid receptor 2 (CB2) agonists. J Med Chem51:5019-34 (2008) 
 
Cannabinoid receptor 1
Name:Cannabinoid receptor 1
Type:G Protein-Coupled Receptor (GPCR)
Mol. Mass.:52856.55
Organism:Rattus norvegicus (rat)
Description:P20272
Residue:473
BDBM50272276
NameBDBM50272276
Synonyms:CHEMBL499050 | N-(6-Chloro-1,8-naphthyridin-3-yl)-3-(3-(2-chloro-4-fluorophenyl)-1,2,4-oxadiazol-5-yl)propanamide
TypeSmall organic molecule
Emp. Form.C19H12Cl2FN5O2
Mol. Mass.432.235
SMILESFc1ccc(-c2noc(CCC(=O)Nc3cnc4ncc(Cl)cc4c3)n2)c(Cl)c1