Reaction Details
TargetCannabinoid receptor 1
LigandBDBM50272274
Substrate/Competitorn/a
Meas. Tech.ChEMBL_510483 (CHEMBL1006424)
EC50 150±n/a nM
Citation Cheng, YAlbrecht, BKBrown, JBuchanan, JLBuckner, WHDiMauro, EFEmkey, RFremeau, RTHarmange, JCHoffman, BJHuang, LHuang, MLee, JHLin, FFMartin, MWNguyen, HQPatel, VFTomlinson, SAWhite, RDXia, XHitchcock, SA Discovery and optimization of a novel series of N-arylamide oxadiazoles as potent, highly selective and orally bioavailable cannabinoid receptor 2 (CB2) agonists. J Med Chem51:5019-34 (2008) 
 
Cannabinoid receptor 1
Name:Cannabinoid receptor 1
Type:G Protein-Coupled Receptor (GPCR)
Mol. Mass.:52856.55
Organism:Rattus norvegicus (rat)
Description:P20272
Residue:473
BDBM50272274
NameBDBM50272274
Synonyms:CHEMBL500655 | N-(9-Ethyl-9H-carbazol-3-yl)-3-(3-(tetrahydro-2H-pyran-4-yl)-1,2,4-oxadiazol-5-yl)propanamide
TypeSmall organic molecule
Emp. Form.C24H26N4O3
Mol. Mass.418.4882
SMILESCCn1c2ccccc2c2cc(NC(=O)CCc3nc(no3)C3CCOCC3)ccc12