Reaction Details
TargetCannabinoid receptor 2
LigandBDBM50272567
Substrate/Competitorn/a
Meas. Tech.ChEMBL_510487 (CHEMBL1006428)
Ki 5.5±n/a nM
Citation Cheng, YAlbrecht, BKBrown, JBuchanan, JLBuckner, WHDiMauro, EFEmkey, RFremeau, RTHarmange, JCHoffman, BJHuang, LHuang, MLee, JHLin, FFMartin, MWNguyen, HQPatel, VFTomlinson, SAWhite, RDXia, XHitchcock, SA Discovery and optimization of a novel series of N-arylamide oxadiazoles as potent, highly selective and orally bioavailable cannabinoid receptor 2 (CB2) agonists. J Med Chem51:5019-34 (2008) 
 
Cannabinoid receptor 2
Name:Cannabinoid receptor 2
Type:G Protein-Coupled Receptor (GPCR)
Mol. Mass.:39690.94
Organism:Homo sapiens (Human)
Description:P34972
Residue:360
BDBM50272567
NameBDBM50272567
Synonyms:1-(4-fluorobenzyl)-N-cyclohexyl-7-methyl-4-oxo-1,4-dihydro-1,8-naphthyridine-3-carboxamide | CHEMBL497304
TypeSmall organic molecule
Emp. Form.C23H24FN3O2
Mol. Mass.393.454
SMILESCc1ccc2c(n1)n(Cc1ccc(F)cc1)cc(C(=O)NC1CCCCC1)c2=O