Reaction Details
TargetCannabinoid receptor 2
LigandBDBM50272346
Substrate/Competitorn/a
Meas. Tech.ChEMBL_510480 (CHEMBL1006421)
EC50 0.7±n/a nM
Citation Cheng, YAlbrecht, BKBrown, JBuchanan, JLBuckner, WHDiMauro, EFEmkey, RFremeau, RTHarmange, JCHoffman, BJHuang, LHuang, MLee, JHLin, FFMartin, MWNguyen, HQPatel, VFTomlinson, SAWhite, RDXia, XHitchcock, SA Discovery and optimization of a novel series of N-arylamide oxadiazoles as potent, highly selective and orally bioavailable cannabinoid receptor 2 (CB2) agonists. J Med Chem51:5019-34 (2008) 
 
Cannabinoid receptor 2
Name:Cannabinoid receptor 2
Type:G Protein-Coupled Receptor (GPCR)
Mol. Mass.:39690.94
Organism:Homo sapiens (Human)
Description:P34972
Residue:360
BDBM50272346
NameBDBM50272346
Synonyms:CHEMBL499060 | N-(5-tert-Butylisoxazol-3-yl)-3-(3-(2-chloro-4-fluorophenyl)-1,2,4-oxadiazol-5-yl)propanamide
TypeSmall organic molecule
Emp. Form.C18H18ClFN4O3
Mol. Mass.392.812
SMILESCC(C)(C)c1cc(NC(=O)CCc2nc(no2)-c2ccc(F)cc2Cl)no1