Reaction Details
TargetCannabinoid receptor 2
LigandBDBM50272343
Substrate/Competitorn/a
Meas. Tech.ChEMBL_510480 (CHEMBL1006421)
EC50 78±n/a nM
Citation Cheng, YAlbrecht, BKBrown, JBuchanan, JLBuckner, WHDiMauro, EFEmkey, RFremeau, RTHarmange, JCHoffman, BJHuang, LHuang, MLee, JHLin, FFMartin, MWNguyen, HQPatel, VFTomlinson, SAWhite, RDXia, XHitchcock, SA Discovery and optimization of a novel series of N-arylamide oxadiazoles as potent, highly selective and orally bioavailable cannabinoid receptor 2 (CB2) agonists. J Med Chem51:5019-34 (2008) 
 
Cannabinoid receptor 2
Name:Cannabinoid receptor 2
Type:G Protein-Coupled Receptor (GPCR)
Mol. Mass.:39690.94
Organism:Homo sapiens (Human)
Description:P34972
Residue:360
BDBM50272343
NameBDBM50272343
Synonyms:3-(3-(2-Chloro-4-fluorophenyl)-1,2,4-oxadiazol-5-yl)-N-(6-(trifluoromethyl)pyridin-3-yl)propanamide | CHEMBL500926
TypeSmall organic molecule
Emp. Form.C17H11ClF4N4O2
Mol. Mass.414.741
SMILESFc1ccc(-c2noc(CCC(=O)Nc3ccc(nc3)C(F)(F)F)n2)c(Cl)c1