Reaction Details
TargetCannabinoid receptor 2
LigandBDBM50272234
Substrate/Competitorn/a
Meas. Tech.ChEMBL_510480 (CHEMBL1006421)
EC50 0.33±n/a nM
Citation Cheng, YAlbrecht, BKBrown, JBuchanan, JLBuckner, WHDiMauro, EFEmkey, RFremeau, RTHarmange, JCHoffman, BJHuang, LHuang, MLee, JHLin, FFMartin, MWNguyen, HQPatel, VFTomlinson, SAWhite, RDXia, XHitchcock, SA Discovery and optimization of a novel series of N-arylamide oxadiazoles as potent, highly selective and orally bioavailable cannabinoid receptor 2 (CB2) agonists. J Med Chem51:5019-34 (2008) 
 
Cannabinoid receptor 2
Name:Cannabinoid receptor 2
Type:G Protein-Coupled Receptor (GPCR)
Mol. Mass.:39690.94
Organism:Homo sapiens (Human)
Description:P34972
Residue:360
BDBM50272234
NameBDBM50272234
Synonyms:3-(3-(2-Cyano-4-fluorophenyl)-1,2,4-oxadiazol-5-yl)-N-(9-ethyl-9H-carbazol-3-yl)propanamide | CHEMBL499324
TypeSmall organic molecule
Emp. Form.C26H20FN5O2
Mol. Mass.453.4677
SMILESCCn1c2ccccc2c2cc(NC(=O)CCc3nc(no3)-c3ccc(F)cc3C#N)ccc12