Reaction Details
TargetCannabinoid receptor 1
LigandBDBM50272395
Substrate/Competitorn/a
Meas. Tech.ChEMBL_510475 (CHEMBL1006416)
EC50 1100±n/a nM
Citation Cheng, YAlbrecht, BKBrown, JBuchanan, JLBuckner, WHDiMauro, EFEmkey, RFremeau, RTHarmange, JCHoffman, BJHuang, LHuang, MLee, JHLin, FFMartin, MWNguyen, HQPatel, VFTomlinson, SAWhite, RDXia, XHitchcock, SA Discovery and optimization of a novel series of N-arylamide oxadiazoles as potent, highly selective and orally bioavailable cannabinoid receptor 2 (CB2) agonists. J Med Chem51:5019-34 (2008) 
 
Cannabinoid receptor 1
Name:Cannabinoid receptor 1
Type:G Protein-Coupled Receptor (GPCR)
Mol. Mass.:52868.96
Organism:Homo sapiens (Human)
Description:P21554
Residue:472
BDBM50272395
NameBDBM50272395
Synonyms:CHEMBL499066 | N-(3-(3-(2-Chloro-4-fluorophenyl)-1,2,4-oxadiazol-5-yl)propyl)-6-(trifluoromethoxy)quinolin-3-amine
TypeSmall organic molecule
Emp. Form.C21H15ClF4N4O2
Mol. Mass.466.816
SMILESFc1ccc(-c2noc(CCCNc3ccc4ncc(OC(F)(F)F)cc4c3)n2)c(Cl)c1