Reaction Details
TargetCannabinoid receptor 1
LigandBDBM50272174
Substrate/Competitorn/a
Meas. Tech.ChEMBL_510475 (CHEMBL1006416)
EC50>10000±n/a nM
Citation Cheng, YAlbrecht, BKBrown, JBuchanan, JLBuckner, WHDiMauro, EFEmkey, RFremeau, RTHarmange, JCHoffman, BJHuang, LHuang, MLee, JHLin, FFMartin, MWNguyen, HQPatel, VFTomlinson, SAWhite, RDXia, XHitchcock, SA Discovery and optimization of a novel series of N-arylamide oxadiazoles as potent, highly selective and orally bioavailable cannabinoid receptor 2 (CB2) agonists. J Med Chem51:5019-34 (2008) 
 
Cannabinoid receptor 1
Name:Cannabinoid receptor 1
Type:G Protein-Coupled Receptor (GPCR)
Mol. Mass.:52868.96
Organism:Homo sapiens (Human)
Description:P21554
Residue:472
BDBM50272174
NameBDBM50272174
Synonyms:3-(3-(3-Chlorophenyl)-1,2,4-oxadiazol-5-yl)-N-(9-ethyl-9H-carbazol-3-yl)propanamide | CHEMBL499627
TypeSmall organic molecule
Emp. Form.C25H21ClN4O2
Mol. Mass.444.913
SMILESCCn1c2ccccc2c2cc(NC(=O)CCc3nc(no3)-c3cccc(Cl)c3)ccc12