Reaction Details
TargetCannabinoid receptor 1
LigandBDBM50272085
Substrate/Competitorn/a
Meas. Tech.ChEMBL_510475 (CHEMBL1006416)
EC50>10000±n/a nM
Citation Cheng, YAlbrecht, BKBrown, JBuchanan, JLBuckner, WHDiMauro, EFEmkey, RFremeau, RTHarmange, JCHoffman, BJHuang, LHuang, MLee, JHLin, FFMartin, MWNguyen, HQPatel, VFTomlinson, SAWhite, RDXia, XHitchcock, SA Discovery and optimization of a novel series of N-arylamide oxadiazoles as potent, highly selective and orally bioavailable cannabinoid receptor 2 (CB2) agonists. J Med Chem51:5019-34 (2008) 
 
Cannabinoid receptor 1
Name:Cannabinoid receptor 1
Type:G Protein-Coupled Receptor (GPCR)
Mol. Mass.:52868.96
Organism:Homo sapiens (Human)
Description:P21554
Residue:472
BDBM50272085
NameBDBM50272085
Synonyms:CHEMBL499332 | N-(9-Ethyl-9H-carbazol-3-yl)-3-(5-(2-fluorophenyl)-2H-tetrazol-2-yl)propanamide
TypeSmall organic molecule
Emp. Form.C24H21FN6O
Mol. Mass.428.4615
SMILESCCn1c2ccccc2c2cc(NC(=O)CCn3nnc(n3)-c3ccccc3F)ccc12