Reaction Details
TargetCannabinoid receptor 1
LigandBDBM50272601
Substrate/Competitorn/a
Meas. Tech.ChEMBL_510475 (CHEMBL1006416)
EC50>10000±n/a nM
Citation Cheng, YAlbrecht, BKBrown, JBuchanan, JLBuckner, WHDiMauro, EFEmkey, RFremeau, RTHarmange, JCHoffman, BJHuang, LHuang, MLee, JHLin, FFMartin, MWNguyen, HQPatel, VFTomlinson, SAWhite, RDXia, XHitchcock, SA Discovery and optimization of a novel series of N-arylamide oxadiazoles as potent, highly selective and orally bioavailable cannabinoid receptor 2 (CB2) agonists. J Med Chem51:5019-34 (2008) 
 
Cannabinoid receptor 1
Name:Cannabinoid receptor 1
Type:G Protein-Coupled Receptor (GPCR)
Mol. Mass.:52868.96
Organism:Homo sapiens (Human)
Description:P21554
Residue:472
BDBM50272601
NameBDBM50272601
Synonyms:CHEMBL498324 | N-(9-Ethyl-9H-carbazol-3-yl)-3-(5-(2-fluorophenyl)-1H-pyrazol-3-yl)propanamide
TypeSmall organic molecule
Emp. Form.C26H23FN4O
Mol. Mass.426.4854
SMILESCCn1c2ccccc2c2cc(NC(=O)CCc3cc(n[nH]3)-c3ccccc3F)ccc12