Reaction Details
TargetCannabinoid receptor 2
LigandBDBM50272429
Substrate/Competitorn/a
Meas. Tech.ChEMBL_510476 (CHEMBL1006417)
EC50 4.9±n/a nM
Citation Cheng, YAlbrecht, BKBrown, JBuchanan, JLBuckner, WHDiMauro, EFEmkey, RFremeau, RTHarmange, JCHoffman, BJHuang, LHuang, MLee, JHLin, FFMartin, MWNguyen, HQPatel, VFTomlinson, SAWhite, RDXia, XHitchcock, SA Discovery and optimization of a novel series of N-arylamide oxadiazoles as potent, highly selective and orally bioavailable cannabinoid receptor 2 (CB2) agonists. J Med Chem51:5019-34 (2008) 
 
Cannabinoid receptor 2
Name:Cannabinoid receptor 2
Type:G Protein-Coupled Receptor (GPCR)
Mol. Mass.:39690.94
Organism:Homo sapiens (Human)
Description:P34972
Residue:360
BDBM50272429
NameBDBM50272429
Synonyms:2-tert-Butyl-5-(3-(3-(2-chloro-4-fluorophenyl)-1,2,4-oxadiazol-5-yl)propoxy)pyrimidine | CHEMBL524826
TypeSmall organic molecule
Emp. Form.C19H20ClFN4O2
Mol. Mass.390.839
SMILESCC(C)(C)c1ncc(OCCCc2nc(no2)-c2ccc(F)cc2Cl)cn1