Reaction Details
TargetCannabinoid receptor 2
LigandBDBM50272084
Substrate/Competitorn/a
Meas. Tech.ChEMBL_510476 (CHEMBL1006417)
EC50 190±n/a nM
Citation Cheng, YAlbrecht, BKBrown, JBuchanan, JLBuckner, WHDiMauro, EFEmkey, RFremeau, RTHarmange, JCHoffman, BJHuang, LHuang, MLee, JHLin, FFMartin, MWNguyen, HQPatel, VFTomlinson, SAWhite, RDXia, XHitchcock, SA Discovery and optimization of a novel series of N-arylamide oxadiazoles as potent, highly selective and orally bioavailable cannabinoid receptor 2 (CB2) agonists. J Med Chem51:5019-34 (2008) 
 
Cannabinoid receptor 2
Name:Cannabinoid receptor 2
Type:G Protein-Coupled Receptor (GPCR)
Mol. Mass.:39690.94
Organism:Homo sapiens (Human)
Description:P34972
Residue:360
BDBM50272084
NameBDBM50272084
Synonyms:CHEMBL527051 | N-(9-Ethyl-9H-carbazol-3-yl)-3-(5-(2-fluorophenyl)-1,2,4-oxadiazol-3-yl)propanamide
TypeSmall organic molecule
Emp. Form.C25H21FN4O2
Mol. Mass.428.4582
SMILESCCn1c2ccccc2c2cc(NC(=O)CCc3noc(n3)-c3ccccc3F)ccc12