Reaction Details
TargetGamma-aminobutyric acid receptor subunit alpha-3
LigandBDBM50244261
Substrate/Competitorn/a
Meas. Tech.ChEMBL_491123 (CHEMBL991891)
Ki 255±n/a nM
Citation Harris, DClayton, TCook, JSahbaie, PHalliwell, RFFurtmüller, RHuck, SSieghart, WDeLorey, TM Selective influence on contextual memory: physiochemical properties associated with selectivity of benzodiazepine ligands at GABAA receptors containing the alpha5 subunit. J Med Chem51:3788-803 (2008) 
 
Gamma-aminobutyric acid receptor subunit alpha-3
Name:Gamma-aminobutyric acid receptor subunit alpha-3
Type:Enzyme Catalytic Domain
Mol. Mass.:55175.47
Organism:Homo sapiens (Human)
Description:GABA A Alpha3Beta1Gamma2 0 HUMAN::P34903
Residue:492
BDBM50244261
NameBDBM50244261
Synonyms:5-Methyl-6-oxo-8-trimethylsilanylethynyl-3a,4,5,6-tetrahydro-1H-2,5,10b-triaza-benzo[e]azulene-3-carboxylic acid tert-butyl ester | CHEMBL471977
TypeSmall organic molecule
Emp. Form.C22H29N3O3Si
Mol. Mass.411.5695
SMILESCN1CC2N(CN=C2C(=O)OC(C)(C)C)c2ccc(cc2C1=O)C#C[Si](C)(C)C