Reaction Details
TargetGamma-aminobutyric acid receptor subunit alpha-1
LigandBDBM50244119
Substrate/Competitorn/a
Meas. Tech.ChEMBL_491118 (CHEMBL991886)
Kd 121±n/a nM
Citation Harris, DClayton, TCook, JSahbaie, PHalliwell, RFFurtmüller, RHuck, SSieghart, WDeLorey, TM Selective influence on contextual memory: physiochemical properties associated with selectivity of benzodiazepine ligands at GABAA receptors containing the alpha5 subunit. J Med Chem51:3788-803 (2008) 
 
Gamma-aminobutyric acid receptor subunit alpha-1
Name:Gamma-aminobutyric acid receptor subunit alpha-1
Type:Protein
Mol. Mass.:51817.35
Organism:Homo sapiens (Human)
Description:P14867
Residue:456
BDBM50244119
NameBDBM50244119
Synonyms:CHEMBL461716 | ethyl 4-methyl-5-oxo-7-(2-(trimethylsilyl)ethynyl)-4,5-dihydroimidazo[1,5-a]quinazoline-3-carboxylate
TypeSmall organic molecule
Emp. Form.C19H21N3O3Si
Mol. Mass.367.4738
SMILESCCOC(=O)c1ncn2c1n(C)c(=O)c1cc(ccc21)C#C[Si](C)(C)C