Reaction Details
TargetGamma-aminobutyric acid receptor subunit alpha-1
LigandBDBM50067419
Substrate/Competitorn/a
Meas. Tech.ChEMBL_491118 (CHEMBL991886)
Kd 83±n/a nM
Citation Harris, DClayton, TCook, JSahbaie, PHalliwell, RFFurtmüller, RHuck, SSieghart, WDeLorey, TM Selective influence on contextual memory: physiochemical properties associated with selectivity of benzodiazepine ligands at GABAA receptors containing the alpha5 subunit. J Med Chem51:3788-803 (2008) 
 
Gamma-aminobutyric acid receptor subunit alpha-1
Name:Gamma-aminobutyric acid receptor subunit alpha-1
Type:Protein
Mol. Mass.:51817.35
Organism:Homo sapiens (Human)
Description:P14867
Residue:456
BDBM50067419
NameBDBM50067419
Synonyms:CHEMBL130416 ethyl 9-oxo-7-(2-trimethylsilyl-1-ethynyl)-(12aS)-12,12a-dihydro-9H,11H-azeto[1,2-a]benzo[e]imidazo[5,1-c][1,4]diazepine-1-carboxylate
TypeSmall organic molecule
Emp. Form.C21H23N3O3Si
Mol. Mass.393.5111
SMILESCCOC(=O)c1ncn-2c1[C@@H]1CCN1C(=O)c1cc(ccc-21)C#C[Si](C)(C)C