Reaction Details
TargetGamma-aminobutyric acid receptor subunit alpha-1
LigandBDBM50244072
Substrate/Competitorn/a
Meas. Tech.ChEMBL_491118 (CHEMBL991886)
Kd 20.4±n/a nM
Citation Harris, DClayton, TCook, JSahbaie, PHalliwell, RFFurtmüller, RHuck, SSieghart, WDeLorey, TM Selective influence on contextual memory: physiochemical properties associated with selectivity of benzodiazepine ligands at GABAA receptors containing the alpha5 subunit. J Med Chem51:3788-803 (2008) 
 
Gamma-aminobutyric acid receptor subunit alpha-1
Name:Gamma-aminobutyric acid receptor subunit alpha-1
Type:Protein
Mol. Mass.:51817.35
Organism:Homo sapiens (Human)
Description:P14867
Residue:456
BDBM50244072
NameBDBM50244072
Synonyms:8-Ethyl-5-methyl-6-oxo-3a,4,5,6-tetrahydro-1H-2,5,10b-triaza-benzo[e]azulene-3-carboxylic acid ethyl ester | CHEMBL454865
TypeSmall organic molecule
Emp. Form.C17H21N3O3
Mol. Mass.315.3669
SMILESCCOC(=O)C1=NCN2C1CN(C)C(=O)c1cc(CC)ccc21