Reaction Details
TargetGamma-aminobutyric acid receptor subunit alpha-1
LigandBDBM84956
Substrate/Competitorn/a
Meas. Tech.ChEMBL_491118 (CHEMBL991886)
Kd 0.1±n/a nM
Citation Harris, DClayton, TCook, JSahbaie, PHalliwell, RFFurtmüller, RHuck, SSieghart, WDeLorey, TM Selective influence on contextual memory: physiochemical properties associated with selectivity of benzodiazepine ligands at GABAA receptors containing the alpha5 subunit. J Med Chem51:3788-803 (2008) 
 
Gamma-aminobutyric acid receptor subunit alpha-1
Name:Gamma-aminobutyric acid receptor subunit alpha-1
Type:Protein
Mol. Mass.:51817.35
Organism:Homo sapiens (Human)
Description:P14867
Residue:456
BDBM84956
NameBDBM84956
Synonyms:2-(4-Methoxy-phenyl)-2,5-dihydro-pyrazolo[4,3-c]quinolin-3-one (CGS 9895) CHEMBL296335
TypeSmall organic molecule
Emp. Form.C17H13N3O2
Mol. Mass.291.304
SMILESCOc1ccc(cc1)-n1[nH]c2c(cnc3ccccc23)c1=O