Reaction Details
TargetGamma-aminobutyric acid receptor subunit alpha-1
LigandBDBM50244037
Substrate/Competitorn/a
Meas. Tech.ChEMBL_491118 (CHEMBL991886)
Kd 5±n/a nM
Citation Harris, DClayton, TCook, JSahbaie, PHalliwell, RFFurtmüller, RHuck, SSieghart, WDeLorey, TM Selective influence on contextual memory: physiochemical properties associated with selectivity of benzodiazepine ligands at GABAA receptors containing the alpha5 subunit. J Med Chem51:3788-803 (2008) 
 
Gamma-aminobutyric acid receptor subunit alpha-1
Name:Gamma-aminobutyric acid receptor subunit alpha-1
Type:Protein
Mol. Mass.:51817.35
Organism:Homo sapiens (Human)
Description:P14867
Residue:456
BDBM50244037
NameBDBM50244037
Synonyms:3-propoxy-9H-pyrido[3,4-b]indole | CHEMBL499814
TypeSmall organic molecule
Emp. Form.C14H14N2O
Mol. Mass.226.2738
SMILESCCCOc1cc2c(cn1)[nH]c1ccccc21