Reaction Details
TargetGamma-aminobutyric acid receptor subunit alpha-1
LigandBDBM50244035
Substrate/Competitorn/a
Meas. Tech.ChEMBL_491118 (CHEMBL991886)
Kd 1±n/a nM
Citation Harris, DClayton, TCook, JSahbaie, PHalliwell, RFFurtmüller, RHuck, SSieghart, WDeLorey, TM Selective influence on contextual memory: physiochemical properties associated with selectivity of benzodiazepine ligands at GABAA receptors containing the alpha5 subunit. J Med Chem51:3788-803 (2008) 
 
Gamma-aminobutyric acid receptor subunit alpha-1
Name:Gamma-aminobutyric acid receptor subunit alpha-1
Type:Protein
Mol. Mass.:51817.35
Organism:Homo sapiens (Human)
Description:P14867
Residue:456
BDBM50244035
NameBDBM50244035
Synonyms:Beta CCE cid_105078 | ethyl 9H-pyrido[3,4-b]indole-3-carboxylate
TypeSmall organic molecule
Emp. Form.C14H12N2O2
Mol. Mass.240.2573
SMILESCCOC(=O)c1cc2c(cn1)[nH]c1ccccc21