Reaction Details
TargetGamma-aminobutyric acid receptor subunit alpha-1
LigandBDBM50083894
Substrate/Competitorn/a
Meas. Tech.ChEMBL_491118 (CHEMBL991886)
Kd 76±n/a nM
Citation Harris, DClayton, TCook, JSahbaie, PHalliwell, RFFurtmüller, RHuck, SSieghart, WDeLorey, TM Selective influence on contextual memory: physiochemical properties associated with selectivity of benzodiazepine ligands at GABAA receptors containing the alpha5 subunit. J Med Chem51:3788-803 (2008) 
 
Gamma-aminobutyric acid receptor subunit alpha-1
Name:Gamma-aminobutyric acid receptor subunit alpha-1
Type:Protein
Mol. Mass.:51817.35
Organism:Homo sapiens (Human)
Description:P14867
Residue:456
BDBM50083894
NameBDBM50083894
Synonyms:7-Ethynyl-1-methyl-5-phenyl-1,3-dihydro-benzo[e][1,4]diazepin-2-one(Q-II-66) CHEMBL174535
TypeSmall organic molecule
Emp. Form.C18H14N2O
Mol. Mass.274.3166
SMILESCN1c2ccc(cc2C(=NCC1=O)c1ccccc1)C#C