Reaction Details
TargetB1 bradykinin receptor
LigandBDBM50243228
Substrate/Competitorn/a
Meas. Tech.ChEMBL_487377 (CHEMBL1021904)
Ki 24±n/a nM
Citation Su, DSLim, JLTinney, EWan, BLMurphy, KLReiss, DRHarrell, CMO'Malley, SSRansom, RWChang, RSPettibone, DJYu, JTang, CPrueksaritanont, TFreidinger, RMBock, MGAnthony, NJ 2-Aminobenzophenones as a novel class of bradykinin B1 receptor antagonists. J Med Chem51:3946-52 (2008) 
 
B1 bradykinin receptor
Name:B1 bradykinin receptor
Type:Enzyme
Mol. Mass.:40508.87
Organism:Homo sapiens (Human)
Description:P46663
Residue:353
BDBM50243228
NameBDBM50243228
Synonyms:CHEMBL487620 | N-(2-Benzoylphenyl)-4-({[(2-methoxyethyl)amino]carbonyl}-amino)benzenesulfonamide
TypeSmall organic molecule
Emp. Form.C23H23N3O5S
Mol. Mass.453.511
SMILESCOCCNC(=O)Nc1ccc(cc1)S(=O)(=O)Nc1ccccc1C(=O)c1ccccc1