Reaction Details
TargetGlutamate receptor 3
LigandBDBM50252873
Substrate/Competitorn/a
Meas. Tech.ChEMBL_539473 (CHEMBL1028969)
Ki 434±n/a nM
Citation Butini, SPickering, DSMorelli, ECoccone, SSTrotta, FDe Angelis, MGuarino, EFiorini, ICampiani, GNovellino, ESchousboe, AChristensen, JKGemma, S 1H-cyclopentapyrimidine-2,4(1H,3H)-dione-related ionotropic glutamate receptors ligands. structure-activity relationships and identification of potent and Selective iGluR5 modulators. J Med Chem51:6614-8 (2008) 
 
Glutamate receptor 3
Name:Glutamate receptor 3
Type:Enzyme Catalytic Domain
Mol. Mass.:100383.57
Organism:RAT
Description:Glutamate-AMPA GRIA3 RAT::P19492
Residue:888
BDBM50252873
NameBDBM50252873
Synonyms:2-amino-3-(5-bromo-2,4-dioxo-3,4-dihydropyrimidin-1(2H)-yl)propanoic acid | CHEMBL449296
TypeSmall organic molecule
Emp. Form.C7H8BrN3O4
Mol. Mass.278.06
SMILESNC(Cn1cc(Br)c(=O)[nH]c1=O)C(O)=O