Reaction Details
TargetHistone acetyltransferase KAT2B
LigandBDBM50247615
Substrate/Competitorn/a
Meas. Tech.ChEMBL_495684 (CHEMBL1006963)
IC50 3100±n/a nM
Citation Gorsuch, SBavetsias, VRowlands, MGAherne, GWWorkman, PJarman, MMcDonald, E Synthesis of isothiazol-3-one derivatives as inhibitors of histone acetyltransferases (HATs). Bioorg Med Chem17:467-74 (2009) 
 
Histone acetyltransferase KAT2B
Name:Histone acetyltransferase KAT2B
Type:PROTEIN
Mol. Mass.:93045.76
Organism:Homo sapiens (Human)
Description:ChEMBL_1502838
Residue:832
BDBM50247615
NameBDBM50247615
Synonyms:2-(3,4,5-trifluorophenyl)isothiazol-3(2H)-one | CHEMBL489101
TypeSmall organic molecule
Emp. Form.C9H4F3NOS
Mol. Mass.231.194
SMILESFc1cc(cc(F)c1F)-n1sccc1=O