Reaction Details
TargetHistone acetyltransferase KAT2B
LigandBDBM50247616
Substrate/Competitorn/a
Meas. Tech.ChEMBL_495684 (CHEMBL1006963)
IC50 5400±n/a nM
Citation Gorsuch, SBavetsias, VRowlands, MGAherne, GWWorkman, PJarman, MMcDonald, E Synthesis of isothiazol-3-one derivatives as inhibitors of histone acetyltransferases (HATs). Bioorg Med Chem17:467-74 (2009) 
 
Histone acetyltransferase KAT2B
Name:Histone acetyltransferase KAT2B
Type:PROTEIN
Mol. Mass.:93045.76
Organism:Homo sapiens (Human)
Description:ChEMBL_1502838
Residue:832
BDBM50247616
NameBDBM50247616
Synonyms:2-(3-chloro-2-fluorophenyl)isothiazol-3(2H)-one | CHEMBL489102
TypeSmall organic molecule
Emp. Form.C9H5ClFNOS
Mol. Mass.229.659
SMILESFc1c(Cl)cccc1-n1sccc1=O