Reaction Details
TargetHistamine H2 receptor
LigandBDBM50413172
Substrate/Competitorn/a
Meas. Tech.ChEMBL_493052 (CHEMBL953166)
EC50 53.7±n/a nM
Citation Ghorai, PKraus, AKeller, MGötte, CIgel, PSchneider, ESchnell, DBernhardt, GDove, SZabel, MElz, SSeifert, RBuschauer, A Acylguanidines as bioisosteres of guanidines: NG-acylated imidazolylpropylguanidines, a new class of histamine H2 receptor agonists. J Med Chem51:7193-204 (2009) 
 
Histamine H2 receptor
Name:Histamine H2 receptor
Type:G Protein-Coupled Receptor (GPCR)
Mol. Mass.:40567.22
Organism:Cavia porcellus (domestic guinea pig)
Description:For the H2 receptor-binding assays, guinea pig striatum was used.
Residue:359
BDBM50413172
NameBDBM50413172
Synonyms:CHEMBL512716
TypeSmall organic molecule
Emp. Form.C22H23F2N5O
Mol. Mass.411.4477
SMILESNC(NC(=O)CC(c1ccccc1)c1ccc(F)c(F)c1)=NCCCc1cnc[nH]1