Reaction Details
TargetTransporter
LigandBDBM50032379
Substrate/Competitorn/a
Meas. Tech.ChEMBL_493246 (CHEMBL948476)
IC50 100±n/a nM
Citation Dyck, BTamiya, JJovic, FPick, RRBradbury, MJO'Brien, JWen, JJohns, MMadan, AFleck, BAFoster, ACLi, BZhang, MTran, JAVickers, TGrey, JSaunders, JChen, C Characterization of thien-2-yl 1S,2R-milnacipran analogues as potent norepinephrine/serotonin transporter inhibitors for the treatment of neuropathic pain. J Med Chem51:7265-72 (2009) 
 
Transporter
Name:Transporter
Type:Multi-pass membrane protein
Mol. Mass.:69236.90
Organism:Rattus norvegicus (rat)
Description:Q63380
Residue:617
BDBM50032379
NameBDBM50032379
Synonyms:(1S,2R)-2-(aminomethyl)-N,N-diethyl-1-phenylcyclopropanecarboxamide CHEMBL99946 | LEVOMILNACIPRAN
TypeSmall organic molecule
Emp. Form.C15H22N2O
Mol. Mass.246.348
SMILESCCN(CC)C(=O)[C@]1(C[C@H]1CN)c1ccccc1