Reaction Details
TargetSerine/threonine-protein kinase pim-1
LigandBDBM50267023
Substrate/Competitorn/a
Meas. Tech.ChEMBL_565356 (CHEMBL955982)
Ki 2100±n/a nM
Citation Olla, SManetti, FCrespan, EMaga, GAngelucci, ASchenone, SBologna, MBotta, M Indolyl-pyrrolone as a new scaffold for Pim1 inhibitors. Bioorg Med Chem Lett19:1512-6 (2009) 
 
Serine/threonine-protein kinase pim-1
Name:Serine/threonine-protein kinase pim-1
Type:Protein
Mol. Mass.:35681.82
Organism:Homo sapiens (Human)
Description:P11309
Residue:313
BDBM50267023
NameBDBM50267023
Synonyms:1-(2-(1H-indol-3-yl)ethyl)-4-acetyl-5-(4-ethylphenyl)-3-hydroxy-1H-pyrrol-2(5H)-one CHEMBL478510
TypeSmall organic molecule
Emp. Form.C24H24N2O3
Mol. Mass.388.459
SMILESCCc1ccc(cc1)C1C(C(C)=O)C(=O)C(=O)N1CCc1c[nH]c2ccccc12