Reaction Details
TargetHydroxycarboxylic acid receptor 2
LigandBDBM50277673
Substrate/Competitorn/a
Meas. Tech.ChEMBL_501320 (CHEMBL971506)
IC50 4800±n/a nM
Citation Imbriglio, JEChang, SLiang, RRaghavan, SSchmidt, DSmenton, ATria, SSchrader, TOJung, JKEsser, CTaggart, AKCheng, KCarballo-Jane, EGerard Waters, MTata, JRColletti, SL GPR109a agonists. Part 1: 5-Alkyl and 5-aryl-pyrazole-tetrazoles as agonists of the human orphan G-protein coupled receptor GPR109a. Bioorg Med Chem Lett19:2121-4 (2009) 
 
Hydroxycarboxylic acid receptor 2
Name:Hydroxycarboxylic acid receptor 2
Type:G Protein-Coupled Receptor (GPCR)
Mol. Mass.:41868.22
Organism:Homo sapiens (Human)
Description:Membranes from CHO cells expressing the recombinant human GPR109A were used in competition binding assay.
Residue:363
BDBM50277673
NameBDBM50277673
Synonyms:5-pentyl-3-(1H-tetrazol-5-yl)-1,4,5,6-tetrahydrocyclopenta[c]pyrazole | CHEMBL482979
TypeSmall organic molecule
Emp. Form.C12H18N6
Mol. Mass.246.3115
SMILESCCCCCC1Cc2[nH]nc(-c3nnn[nH]3)c2C1