Reaction Details
TargetEpidermal growth factor receptor
LigandBDBM50279080
Substrate/Competitorn/a
Meas. Tech.ChEMBL_545072 (CHEMBL1017188)
IC50>10000±n/a nM
Citation Roth, GJHeckel, AColbatzky, FHandschuh, SKley, JLehmann-Lintz, TLotz, RTontsch-Grunt, UWalter, RHilberg, F Design, synthesis, and evaluation of indolinones as triple angiokinase inhibitors and the discovery of a highly specific 6-methoxycarbonyl-substituted indolinone (BIBF 1120). J Med Chem52:4466-80 (2009) 
 
Epidermal growth factor receptor
Name:Epidermal growth factor receptor
Type:Receptor Kinase Domain
Mol. Mass.:134279.59
Organism:Homo sapiens (Human)
Description:P00533
Residue:1210
BDBM50279080
NameBDBM50279080
Synonyms:(Z)-3-[(4-{Methyl-[2-(4-methylpiperazin-1-yl)acetyl]amino}-phenylamino)-methylene]-2-oxo-2,3-dihydro-1H-indole-6-carboxylicAcid Methyl Ester methyl (3Z)-3-{[(4-{methyl[(4-methylpiperazin-1-yl)acetyl]amino}phenyl)amino](phenyl)methylidene}-2-oxo-2,3-dihydro-1H-indole-6-carboxylate
TypeSmall organic molecule
Emp. Form.C31H33N5O4
Mol. Mass.539.6248
SMILESCOC(=O)c1ccc2C(C(=Nc3ccc(cc3)N(C)C(=O)CN3CCN(C)CC3)c3ccccc3)C(=O)Nc2c1