Reaction Details
TargetNeuronal acetylcholine receptor subunit alpha-4
LigandBDBM50278907
Substrate/Competitorn/a
Meas. Tech.ChEMBL_546018 (CHEMBL1028496)
Ki 96±n/a nM
Citation Bunnelle, WHTietje, KRFrost, JMPeters, DJi, JLi, TScanio, MJShi, LAnderson, DJDyhring, TGrønlien, JHWeen, HThorin-Hagene, KMeyer, MD Octahydropyrrolo[3,4-c]pyrrole: a diamine scaffold for construction of either alpha4beta2 or alpha7-selective nicotinic acetylcholine receptor (nAChR) ligands. Substitutions that switch subtype selectivity. J Med Chem52:4126-41 (2009) 
 
Neuronal acetylcholine receptor subunit alpha-4
Name:Neuronal acetylcholine receptor subunit alpha-4
Type:Enzyme
Mol. Mass.:70196.44
Organism:Rattus norvegicus (Rat)
Description:P09483
Residue:630
BDBM50278907
NameBDBM50278907
Synonyms:CHEMBL497727 | cis-2-(6-Phenyl-pyridin-3-yl)-octahydro-pyrrolo[3,4-c]pyrrole Bis-trifluoroacetate
TypeSmall organic molecule
Emp. Form.C17H19N3
Mol. Mass.265.3529
SMILESC1NC[C@@H]2CN(C[C@H]12)c1ccc(nc1)-c1ccccc1