Reaction Details
TargetNeuronal acetylcholine receptor subunit alpha-7
LigandBDBM50278957
Substrate/Competitorn/a
Meas. Tech.ChEMBL_546019 (CHEMBL1028497)
Ki 330±n/a nM
Citation Bunnelle, WHTietje, KRFrost, JMPeters, DJi, JLi, TScanio, MJShi, LAnderson, DJDyhring, TGrønlien, JHWeen, HThorin-Hagene, KMeyer, MD Octahydropyrrolo[3,4-c]pyrrole: a diamine scaffold for construction of either alpha4beta2 or alpha7-selective nicotinic acetylcholine receptor (nAChR) ligands. Substitutions that switch subtype selectivity. J Med Chem52:4126-41 (2009) 
 
Neuronal acetylcholine receptor subunit alpha-7
Name:Neuronal acetylcholine receptor subunit alpha-7
Type:Enzyme
Mol. Mass.:56502.44
Organism:Rattus norvegicus (Rat)
Description:Q05941
Residue:502
BDBM50278957
NameBDBM50278957
Synonyms:CHEMBL498262 cis-2-Ethyl-5-(6-phenyl-pyridazin-3-yl)-octahydro-pyrrolo[3,4-c]-pyrrole Bis-p-toluenesulfonate
TypeSmall organic molecule
Emp. Form.C18H22N4
Mol. Mass.294.3941
SMILESCCN1C[C@H]2CN(C[C@H]2C1)c1ccc(nn1)-c1ccccc1