Reaction Details
TargetNeuronal acetylcholine receptor subunit alpha-4
LigandBDBM50278877
Substrate/Competitorn/a
Meas. Tech.ChEMBL_546018 (CHEMBL1028496)
Ki 0.058±n/a nM
Citation Bunnelle, WHTietje, KRFrost, JMPeters, DJi, JLi, TScanio, MJShi, LAnderson, DJDyhring, TGrønlien, JHWeen, HThorin-Hagene, KMeyer, MD Octahydropyrrolo[3,4-c]pyrrole: a diamine scaffold for construction of either alpha4beta2 or alpha7-selective nicotinic acetylcholine receptor (nAChR) ligands. Substitutions that switch subtype selectivity. J Med Chem52:4126-41 (2009) 
 
Neuronal acetylcholine receptor subunit alpha-4
Name:Neuronal acetylcholine receptor subunit alpha-4
Type:Enzyme
Mol. Mass.:70196.44
Organism:Rattus norvegicus (Rat)
Description:P09483
Residue:630
BDBM50278877
NameBDBM50278877
Synonyms:CHEMBL524911 | cis-2-(5-(Benzyloxy)pyridin-3-yl)octahydropyrrolo[3,4-c]pyrrole
TypeSmall organic molecule
Emp. Form.C18H21N3O
Mol. Mass.295.3788
SMILESC(Oc1cncc(c1)N1C[C@@H]2CNC[C@@H]2C1)c1ccccc1