Reaction Details
TargetNeuronal acetylcholine receptor subunit alpha-4
LigandBDBM50279401
Substrate/Competitorn/a
Meas. Tech.ChEMBL_546018 (CHEMBL1028496)
Ki 0.28±n/a nM
Citation Bunnelle, WHTietje, KRFrost, JMPeters, DJi, JLi, TScanio, MJShi, LAnderson, DJDyhring, TGrønlien, JHWeen, HThorin-Hagene, KMeyer, MD Octahydropyrrolo[3,4-c]pyrrole: a diamine scaffold for construction of either alpha4beta2 or alpha7-selective nicotinic acetylcholine receptor (nAChR) ligands. Substitutions that switch subtype selectivity. J Med Chem52:4126-41 (2009) 
 
Neuronal acetylcholine receptor subunit alpha-4
Name:Neuronal acetylcholine receptor subunit alpha-4
Type:Enzyme
Mol. Mass.:70196.44
Organism:Rattus norvegicus (Rat)
Description:P09483
Residue:630
BDBM50279401
NameBDBM50279401
Synonyms:CHEMBL498943 | cis-5-(6-Bromo-pyridin-3-yl)-hexahydro-pyrrolo[3,4-c]pyrrole Trifluoroacetate
TypeSmall organic molecule
Emp. Form.C11H14BrN3
Mol. Mass.268.153
SMILESBrc1ccc(cn1)N1C[C@@H]2CNC[C@@H]2C1