Reaction Details
TargetNeuronal acetylcholine receptor subunit alpha-7
LigandBDBM50279016
Substrate/Competitorn/a
Meas. Tech.ChEMBL_546019 (CHEMBL1028497)
Ki 22±n/a nM
Citation Bunnelle, WHTietje, KRFrost, JMPeters, DJi, JLi, TScanio, MJShi, LAnderson, DJDyhring, TGrønlien, JHWeen, HThorin-Hagene, KMeyer, MD Octahydropyrrolo[3,4-c]pyrrole: a diamine scaffold for construction of either alpha4beta2 or alpha7-selective nicotinic acetylcholine receptor (nAChR) ligands. Substitutions that switch subtype selectivity. J Med Chem52:4126-41 (2009) 
 
Neuronal acetylcholine receptor subunit alpha-7
Name:Neuronal acetylcholine receptor subunit alpha-7
Type:Enzyme
Mol. Mass.:56502.44
Organism:Rattus norvegicus (Rat)
Description:Q05941
Residue:502
BDBM50279016
NameBDBM50279016
Synonyms:CHEMBL500433 | cis-2-[6-(4-Methoxy-phenyl)-pyridazin-3-yl]-5-methyl-octahydro-pyrrolo[3,4-c]pyrrole p-Toluenesulfonate
TypeSmall organic molecule
Emp. Form.C18H22N4O
Mol. Mass.310.3935
SMILESCOc1ccc(cc1)-c1ccc(nn1)N1C[C@@H]2CN(C)C[C@@H]2C1