Reaction Details
TargetNeuronal acetylcholine receptor subunit alpha-7
LigandBDBM50279402
Substrate/Competitorn/a
Meas. Tech.ChEMBL_546019 (CHEMBL1028497)
Ki 66±n/a nM
Citation Bunnelle, WHTietje, KRFrost, JMPeters, DJi, JLi, TScanio, MJShi, LAnderson, DJDyhring, TGrønlien, JHWeen, HThorin-Hagene, KMeyer, MD Octahydropyrrolo[3,4-c]pyrrole: a diamine scaffold for construction of either alpha4beta2 or alpha7-selective nicotinic acetylcholine receptor (nAChR) ligands. Substitutions that switch subtype selectivity. J Med Chem52:4126-41 (2009) 
 
Neuronal acetylcholine receptor subunit alpha-7
Name:Neuronal acetylcholine receptor subunit alpha-7
Type:Enzyme
Mol. Mass.:56502.44
Organism:Rattus norvegicus (Rat)
Description:Q05941
Residue:502
BDBM50279402
NameBDBM50279402
Synonyms:CHEMBL486511 | cis-2-(5-Bromopyridin-3-yl)-octahydro-pyrrolo[3,4-c]pyrrole Trifluoroacetate
TypeSmall organic molecule
Emp. Form.C11H14BrN3
Mol. Mass.268.153
SMILESBrc1cncc(c1)N1C[C@@H]2CNC[C@@H]2C1