Reaction Details
TargetCalpain-1 catalytic subunit
LigandBDBM50250153
Substrate/Competitorn/a
Meas. Tech.ChEMBL_498764 (CHEMBL1021956)
IC50 3690±n/a nM
Citation Kang, DHJun, KYLee, JPPak, CSNa, YKwon, Y Identification of 3-acetyl-2-aminoquinolin-4-one as a novel, nonpeptidic scaffold for specific calpain inhibitory activity. J Med Chem52:3093-7 (2009) 
 
Calpain-1 catalytic subunit
Name:Calpain-1 catalytic subunit
Type:Protein
Mol. Mass.:81880.51
Organism:Homo sapiens (Human)
Description:n/a
Residue:714
BDBM50250153
NameBDBM50250153
Synonyms:3-acetyl-2-(4-tert-butylphenylamino)-8-chloro-6-nitroquinolin-4(1H)-one | CHEMBL521636
TypeSmall organic molecule
Emp. Form.C21H20ClN3O4
Mol. Mass.413.854
SMILESCC(=O)c1c(Nc2ccc(cc2)C(C)(C)C)nc2c(Cl)cc(cc2c1O)[N+]([O-])=O