Reaction Details
TargetCalpain-1 catalytic subunit
LigandBDBM50249609
Substrate/Competitorn/a
Meas. Tech.ChEMBL_498764 (CHEMBL1021956)
IC50>30000±n/a nM
Citation Kang, DHJun, KYLee, JPPak, CSNa, YKwon, Y Identification of 3-acetyl-2-aminoquinolin-4-one as a novel, nonpeptidic scaffold for specific calpain inhibitory activity. J Med Chem52:3093-7 (2009) 
 
Calpain-1 catalytic subunit
Name:Calpain-1 catalytic subunit
Type:Protein
Mol. Mass.:81880.51
Organism:Homo sapiens (Human)
Description:n/a
Residue:714
BDBM50249609
NameBDBM50249609
Synonyms:3-acetyl-8-chloro-5-fluoro-2-(phenylamino)quinolin-4(1H)-one | CHEMBL471916
TypeSmall organic molecule
Emp. Form.C17H12ClFN2O2
Mol. Mass.330.741
SMILESCC(=O)c1c(O)c2c(F)ccc(Cl)c2nc1Nc1ccccc1