Reaction Details
TargetCalpain-1 catalytic subunit
LigandBDBM50249626
Substrate/Competitorn/a
Meas. Tech.ChEMBL_498764 (CHEMBL1021956)
IC50>30000±n/a nM
Citation Kang, DHJun, KYLee, JPPak, CSNa, YKwon, Y Identification of 3-acetyl-2-aminoquinolin-4-one as a novel, nonpeptidic scaffold for specific calpain inhibitory activity. J Med Chem52:3093-7 (2009) 
 
Calpain-1 catalytic subunit
Name:Calpain-1 catalytic subunit
Type:Protein
Mol. Mass.:81880.51
Organism:Homo sapiens (Human)
Description:n/a
Residue:714
BDBM50249626
NameBDBM50249626
Synonyms:3-acetyl-2-(4-tert-butylphenylamino)-5,8-difluoroquinolin-4(1H)-one | CHEMBL491964
TypeSmall organic molecule
Emp. Form.C21H20F2N2O2
Mol. Mass.370.3925
SMILESCC(=O)c1c(Nc2ccc(cc2)C(C)(C)C)nc2c(F)ccc(F)c2c1O