Reaction Details
TargetCalpain-1 catalytic subunit
LigandBDBM50249658
Substrate/Competitorn/a
Meas. Tech.ChEMBL_498764 (CHEMBL1021956)
IC50>30000±n/a nM
Citation Kang, DHJun, KYLee, JPPak, CSNa, YKwon, Y Identification of 3-acetyl-2-aminoquinolin-4-one as a novel, nonpeptidic scaffold for specific calpain inhibitory activity. J Med Chem52:3093-7 (2009) 
 
Calpain-1 catalytic subunit
Name:Calpain-1 catalytic subunit
Type:Protein
Mol. Mass.:81880.51
Organism:Homo sapiens (Human)
Description:n/a
Residue:714
BDBM50249658
NameBDBM50249658
Synonyms:3-acetyl-2-(3,5-bis(trifluoromethyl)phenylamino)-5,8-difluoroquinolin-4(1H)-one | CHEMBL491898
TypeSmall organic molecule
Emp. Form.C19H10F8N2O2
Mol. Mass.450.2821
SMILESCC(=O)c1c(Nc2cc(cc(c2)C(F)(F)F)C(F)(F)F)nc2c(F)ccc(F)c2c1O