Reaction Details
TargetCalpain-1 catalytic subunit
LigandBDBM50249605
Substrate/Competitorn/a
Meas. Tech.ChEMBL_498765 (CHEMBL1021957)
IC50 1690±n/a nM
Citation Kang, DHJun, KYLee, JPPak, CSNa, YKwon, Y Identification of 3-acetyl-2-aminoquinolin-4-one as a novel, nonpeptidic scaffold for specific calpain inhibitory activity. J Med Chem52:3093-7 (2009) 
 
Calpain-1 catalytic subunit
Name:Calpain-1 catalytic subunit
Type:Protein
Mol. Mass.:81880.51
Organism:Homo sapiens (Human)
Description:n/a
Residue:714
BDBM50249605
NameBDBM50249605
Synonyms:3-acetyl-5,8-dibromo-2-(4-bromophenylamino)quinolin-4(1H)-one | CHEMBL470707
TypeSmall organic molecule
Emp. Form.C17H11Br3N2O2
Mol. Mass.514.993
SMILESCC(=O)c1c(Nc2ccc(Br)cc2)nc2c(Br)ccc(Br)c2c1O