Reaction Details
TargetCathepsin B
LigandBDBM16509
Substrate/Competitorn/a
Meas. Tech.ChEMBL_498766 (CHEMBL1021958)
IC50 7560±n/a nM
Citation Kang, DHJun, KYLee, JPPak, CSNa, YKwon, Y Identification of 3-acetyl-2-aminoquinolin-4-one as a novel, nonpeptidic scaffold for specific calpain inhibitory activity. J Med Chem52:3093-7 (2009) 
 
Cathepsin B
Name:Cathepsin B
Type:Enzyme
Mol. Mass.:37819.69
Organism:Homo sapiens (Human)
Description:gi_63102437
Residue:339
BDBM16509
NameBDBM16509
Synonyms:(2S)-1-[(2S,3S)-3-methyl-2-{[(2S,3S)-3-(propylcarbamoyl)oxiran-2-yl]formamido}pentanoyl]pyrrolidine-2-carboxylic acid CHEMBL490920 PrNH-tES-Ile-Pro-OH | epoxysuccinyl derivative CA074
TypeSmall organic molecule
Emp. Form.C18H29N3O6
Mol. Mass.383.4394
SMILES[H][C@@]1(O[C@]1([H])C(=O)N[C@@H]([C@@H](C)CC)C(=O)N1CCC[C@H]1C(O)=O)C(=O)NCCC